{"text_format":"1","workbook":"xlsx","n_sheets":5,"sheets":["Listes","Sheet1","Analyse infranationale","Budget bailleurs de fonds","Plan National Riposte Covid19"],"not_rendered":{"charts":0,"images":12,"macros":1,"external_links":0,"defined_names":17,"comments":1,"pivot_tables":0},"unopened":[],"bounds":{"document_bytes":16777216,"sheet_cells":100000,"rows_first":2000,"rows_last":500,"rows_between":2000,"halvings":0,"cell_chars":16384,"cell_head_chars":4096},"cells_cut":0,"cells_raw":0,"read":"whole","date_system":"1900"}

{"sheet":"Listes","index":0,"n_rows":106,"n_cols":10,"rows_kept":106,"cut":false,"hidden":false,"merged":[]}
["Listes"]
[]
[]
[]
[null,"Cartographie des ressources et catégories de suivi - Bailleurs de fonds"]
[]
[null,null,"Programme","Abbrév.",null,"Sous Programme","Abbrév.",null,"Sous Programme","Action"]
[null,1,"1. Amélioration de la gouvernance et du leadership ","Programme 1",null,"1.1 : Pilotage, dialogue et coordination des actions et des partenaires du MSP","Sous Programme 1.1",null,"1.1 : Pilotage, dialogue et coordination des actions et des partenaires du MSP","1.1.1 : Promouvoir un dialogue politique multisectoriel en faveur du secteur de la santé"]
[null,2,"2. Accès aux soins et services de santé","Programme 2",null,"1.2 : Réformes sectorielles y compris la décentralisation","Sous Programme 1.2",null,"1.1 : Pilotage, dialogue et coordination des actions et des partenaires du MSP","1.1.2 : Renforcer la coordination des actions et des partenaires "]
[null,3,"3. Prestations des soins et services de santé","Programme 3",null,"1.3 : Contrôles, audits et Inspection Générale des Services","Sous Programme 1.3",null,"1.1 : Pilotage, dialogue et coordination des actions et des partenaires du MSP","1.1.3 : Renforcer la mise en œuvre de la gestion axée sur les résultats"]
[null,4,null,null,null,"1.4 : Participation communautaire","Sous Programme 1.4",null,"1.2 : Réformes sectorielles y compris la décentralisation","1.2.1 : Elaborer une feuille de route pour le suivi de la mise en œuvre des reformes"]
[null,5,null,null,null,"1.5 : Planification, suivi et évaluation","Sous Programme 1.5",null,"1.2 : Réformes sectorielles y compris la décentralisation","1.2.2 : Accélérer la mise en œuvre de la décentralisation dans le secteur de la santé"]
[null,6,null,null,null,"1.6 : Régulation et normalisation","Sous Programme 1.6",null,"1.2 : Réformes sectorielles y compris la décentralisation","1.2.3 : Renforcer la coordination entre la planification sectorielle et les Plans de Développement Communaux (PDC)"]
[null,7,null,null,null,"1.7 : Communication (interne et externe), documentation et archivage","Sous Programme 1.7",null,"1.3 : Contrôles, audits et Inspection Générale des Services","1.3.1 : Renforcer l’Inspection Générale de la Santé (IGS) "]
[null,8,null,null,null,"1.8 : Financement du secteur de la santé (accroissement et gestion)","Sous Programme 1.8",null,"1.3 : Contrôles, audits et Inspection Générale des Services","1.3.2 : Renforcer les activités d’audit interne et externe"]
{"$rows_left_out":92}
{"sheet":"Sheet1","index":1,"n_rows":48,"n_cols":3,"rows_kept":48,"cut":false,"hidden":true,"merged":[]}
["1. Amélioration de la gouvernance et du leadership ","2. Accès aux soins et services de santé","3. Prestations des soins et services de santé"]
[{"$f":"Listes!F8","v":"1.1 : Pilotage, dialogue et coordination des actions et des partenaires du MSP"},{"$f":"Listes!F21","v":"2.1 : Développement des compétences"},{"$f":"Listes!F28","v":"3.1 : Lutte contre les maladies transmissibles"}]
[{"$f":"Listes!F9","v":"1.2 : Réformes sectorielles y compris la décentralisation"},{"$f":"Listes!F22","v":"2.2 : Construction/ Réhabilitation d’infrastructures sanitaires"},{"$f":"Listes!F29","v":"3.2 : Lutte contre les maladies non transmissibles"}]
[{"$f":"Listes!F10","v":"1.3 : Contrôles, audits et Inspection Générale des Services"},{"$f":"Listes!F23","v":"2.3 : Promotion des mécanismes de protection contre le risque financier"},{"$f":"Listes!F30","v":"3.3 : Lutte contre les maladies tropicales négligées"}]
[{"$f":"Listes!F11","v":"1.4 : Participation communautaire"},{"$f":"Listes!F24","v":"2.4 Promotion du secteur sanitaire privé"},{"$f":"Listes!F31","v":"3.4 : Santé de la Reproduction (Santé de la mère, de l'enfant, des adolescents et de l'homme)"}]
[{"$f":"Listes!F12","v":"1.5 : Planification, suivi et évaluation"},{"$f":"Listes!F25","v":"2.5 : Acquisition et maintenance des équipements sanitaires"},{"$f":"Listes!F32","v":"3.5 : Nutrition"}]
[{"$f":"Listes!F13","v":"1.6 : Régulation et normalisation"},{"$f":"Listes!F26","v":"2.6 : Amélioration de la disponibilité des produits de santé"},{"$f":"Listes!F33","v":"3.6 : Promotion de la santé"}]
[{"$f":"Listes!F14","v":"1.7 : Communication (interne et externe), documentation et archivage"},{"$f":"Listes!F27","v":"2.7 : Promotion de la médecine et de la pharmacopée traditionnelles"},{"$f":"Listes!F34","v":"3.7 : Assurance qualité des services et soins de santé"}]
[{"$f":"Listes!F15","v":"1.8 : Financement du secteur de la santé (accroissement et gestion)"},null,{"$f":"Listes!F35","v":"3.8 : Sécurité sanitaire, gestion des épidémies, urgences et catastrophes"}]
[{"$f":"Listes!F16","v":"1.9 : Gestion des ressources matérielles"}]
[{"$f":"Listes!F17","v":"1.10 : Gestion des ressources humaines"}]
[{"$f":"Listes!F18","v":"1.11 : Construction/Réhabilitation et équipement d'infrastructures administratives et éducatives"}]
[{"$f":"Listes!F19","v":"1.12 : Information sanitaire"}]
[{"$f":"Listes!F20","v":"1.13 Promotion de la recherche"}]
[]
{"$rows_left_out":34}
{"sheet":"Analyse infranationale","index":2,"n_rows":37,"n_cols":2,"rows_kept":37,"cut":false,"hidden":false,"merged":[]}
["Analyse infranationale"]
[]
[]
[]
[]
[]
[]
[1,"Agadez"]
[2,"Diffa"]
[3,"Dosso"]
[4,"Maradi"]
[5,"Niamey"]
[6,"Tahoua"]
[7,"Tillaberi"]
[8,"Zinder"]
{"$rows_left_out":23}
{"sheet":"Budget bailleurs de fonds","index":3,"n_rows":155,"n_cols":53,"rows_kept":155,"cut":false,"hidden":false,"merged":[[1,42,1,47]]}
[]
[null,null,"1. Description",null,null,null,null,null,null,null,"2. Spécifications budgétaires",null,null,null,"3. Catégories pour l'analyse granulaire du budget ",null,null,null,null,null,null,null,"4.1 Dépenses exécutées par année",null,null,null,null,"4.2 Engagements Budgétaires par année",null,null,null,null,null,null,"5. Questions spécifiques à la riposte de Covid-19",null,null,null,null,null,null,null,"6. Répartition géographique du budget disponible "]
[null,null,"Intitulé du projet ou du résultat attendu","Intitulé de la composante \n(si pertinent)","Intitulé de l'activité","Source de financement (bailleur de fonds)","Agence d'exécution","État de mise en œuvre du projet","Notes",null,"Fonds propres / additionnels","Si additionnels, indiquer le nom du bailleur à l'origine du financement","Appui budgétaire (Etat) / Appui extra budgétaire ",null,{"$f":"donorcat1","v":"Programme"},{"$f":"donorcat2","v":"Sous Programme"},{"$f":"Listes!J7","v":"Action"},"rows moved","columns moved","height","width",null,2017,2018,2019,2020,"TOTAL",2017,2018,2019,2020,2021,"TOTAL",null,"Financement a Covid-19? (Oui/Non)","Volet","Activité","Fonds a l'origine alloués a covid ou reprogrammation?","En cas de reprogrammation, quelle était la programmation originale?","Quel type d'appui (financier, AT, en nature)","Montant de l'allocation",null,"National",{"$f":"'Analyse infranationale'!$B$8","v":"Agadez"},{"$f":"'Analyse infranationale'!$B$9","v":"Diffa"},{"$f":"'Analyse infranationale'!$B$10","v":"Dosso"},{"$f":"'Analyse infranationale'!$B$11","v":"Maradi"},{"$f":"'Analyse infranationale'!$B$12","v":"Niamey"},{"$f":"'Analyse infranationale'!$B$13","v":"Tahoua"},{"$f":"'Analyse infranationale'!$B$14","v":"Tillaberi"},{"$f":"'Analyse infranationale'!$B$15","v":"Zinder"},"SOMME"]
[null,1,null,null,null,null,null,null,null,null,null,null,null,null,null,null,null,{"$f":"VLOOKUP(P4,Sheet1!$A$21:$C$57,3,FALSE)","v":{"$error":"#N/A"}},1,{"$f":"VLOOKUP(P4,Sheet1!$A$21:$C$57,2,FALSE)","v":{"$error":"#N/A"}},1,null,null,null,null,null,{"$f":"SUM(W4:Z4)","v":0},null,null,null,null,null,{"$f":"SUM(AB4:AF4)","v":0},null,null,null,null,null,null,null,null,null,null,null,null,null,null,null,null,null,null,{"$f":"IF(SUM(AQ4:AY4)=0,0,SUM(AQ4:AY4))","v":0},{"$f":"IF(ISBLANK(C4),\"\",IF(AZ4<>1,\"Error - please ensure all columns add to 100%\",\"\"))","v":""}]
[null,2,null,null,null,null,null,null,null,null,null,null,null,null,null,null,null,{"$f":"VLOOKUP(P5,Sheet1!$A$21:$C$57,3,FALSE)","v":{"$error":"#N/A"}},1,{"$f":"VLOOKUP(P5,Sheet1!$A$21:$C$57,2,FALSE)","v":{"$error":"#N/A"}},1,null,null,null,null,null,{"$f":"SUM(W5:Z5)","v":0},null,null,null,null,null,{"$f":"SUM(AB5:AF5)","v":0},null,null,null,null,null,null,null,null,null,null,null,null,null,null,null,null,null,null,0,{"$f":"IF(ISBLANK(C5),\"\",IF(AZ5<>1,\"Error - please ensure all columns add to 100%\",\"\"))","v":""}]
[null,3,null,null,null,null,null,null,null,null,null,null,null,null,null,null,null,{"$f":"VLOOKUP(P6,Sheet1!$A$21:$C$57,3,FALSE)","v":{"$error":"#N/A"}},1,{"$f":"VLOOKUP(P6,Sheet1!$A$21:$C$57,2,FALSE)","v":{"$error":"#N/A"}},1,null,null,null,null,null,0,null,null,null,null,null,{"$f":"SUM(AB6:AF6)","v":0},null,null,null,null,null,null,null,null,null,null,null,null,null,null,null,null,null,null,0,{"$f":"IF(ISBLANK(C6),\"\",IF(AZ6<>1,\"Error - please ensure all columns add to 100%\",\"\"))","v":""}]
[null,4,null,null,null,null,null,null,null,null,null,null,null,null,null,null,null,{"$f":"VLOOKUP(P7,Sheet1!$A$21:$C$57,3,FALSE)","v":{"$error":"#N/A"}},1,{"$f":"VLOOKUP(P7,Sheet1!$A$21:$C$57,2,FALSE)","v":{"$error":"#N/A"}},1,null,null,null,null,null,0,null,null,null,null,null,{"$f":"SUM(AB7:AF7)","v":0},null,null,null,null,null,null,null,null,null,null,null,null,null,null,null,null,null,null,0,{"$f":"IF(ISBLANK(C7),\"\",IF(AZ7<>1,\"Error - please ensure all columns add to 100%\",\"\"))","v":""}]
[null,5,null,null,null,null,null,null,null,null,null,null,null,null,null,null,null,{"$f":"VLOOKUP(P8,Sheet1!$A$21:$C$57,3,FALSE)","v":{"$error":"#N/A"}},1,{"$f":"VLOOKUP(P8,Sheet1!$A$21:$C$57,2,FALSE)","v":{"$error":"#N/A"}},1,null,null,null,null,null,0,null,null,null,null,null,{"$f":"SUM(AB8:AF8)","v":0},null,null,null,null,null,null,null,null,null,null,null,null,null,null,null,null,null,null,0,{"$f":"IF(ISBLANK(C8),\"\",IF(AZ8<>1,\"Error - please ensure all columns add to 100%\",\"\"))","v":""}]
[null,6,null,null,null,null,null,null,null,null,null,null,null,null,null,null,null,{"$f":"VLOOKUP(P9,Sheet1!$A$21:$C$57,3,FALSE)","v":{"$error":"#N/A"}},1,{"$f":"VLOOKUP(P9,Sheet1!$A$21:$C$57,2,FALSE)","v":{"$error":"#N/A"}},1,null,null,null,null,null,0,null,null,null,null,null,{"$f":"SUM(AB9:AF9)","v":0},null,null,null,null,null,null,null,null,null,null,null,null,null,null,null,null,null,null,0,{"$f":"IF(ISBLANK(C9),\"\",IF(AZ9<>1,\"Error - please ensure all columns add to 100%\",\"\"))","v":""}]
[null,7,null,null,null,null,null,null,null,null,null,null,null,null,null,null,null,{"$f":"VLOOKUP(P10,Sheet1!$A$21:$C$57,3,FALSE)","v":{"$error":"#N/A"}},1,{"$f":"VLOOKUP(P10,Sheet1!$A$21:$C$57,2,FALSE)","v":{"$error":"#N/A"}},1,null,null,null,null,null,0,null,null,null,null,null,{"$f":"SUM(AB10:AF10)","v":0},null,null,null,null,null,null,null,null,null,null,null,null,null,null,null,null,null,null,0,{"$f":"IF(ISBLANK(C10),\"\",IF(AZ10<>1,\"Error - please ensure all columns add to 100%\",\"\"))","v":""}]
[null,8,null,null,null,null,null,null,null,null,null,null,null,null,null,null,null,{"$f":"VLOOKUP(P11,Sheet1!$A$21:$C$57,3,FALSE)","v":{"$error":"#N/A"}},1,{"$f":"VLOOKUP(P11,Sheet1!$A$21:$C$57,2,FALSE)","v":{"$error":"#N/A"}},1,null,null,null,null,null,0,null,null,null,null,null,{"$f":"SUM(AB11:AF11)","v":0},null,null,null,null,null,null,null,null,null,null,null,null,null,null,null,null,null,null,0,{"$f":"IF(ISBLANK(C11),\"\",IF(AZ11<>1,\"Error - please ensure all columns add to 100%\",\"\"))","v":""}]
[null,9,null,null,null,null,null,null,null,null,null,null,null,null,null,null,null,{"$f":"VLOOKUP(P12,Sheet1!$A$21:$C$57,3,FALSE)","v":{"$error":"#N/A"}},1,{"$f":"VLOOKUP(P12,Sheet1!$A$21:$C$57,2,FALSE)","v":{"$error":"#N/A"}},1,null,null,null,null,null,0,null,null,null,null,null,{"$f":"SUM(AB12:AF12)","v":0},null,null,null,null,null,null,null,null,null,null,null,null,null,null,null,null,null,null,0,{"$f":"IF(ISBLANK(C12),\"\",IF(AZ12<>1,\"Error - please ensure all columns add to 100%\",\"\"))","v":""}]
[null,10,null,null,null,null,null,null,null,null,null,null,null,null,null,null,null,{"$f":"VLOOKUP(P13,Sheet1!$A$21:$C$57,3,FALSE)","v":{"$error":"#N/A"}},1,{"$f":"VLOOKUP(P13,Sheet1!$A$21:$C$57,2,FALSE)","v":{"$error":"#N/A"}},1,null,null,null,null,null,0,null,null,null,null,null,{"$f":"SUM(AB13:AF13)","v":0},null,null,null,null,null,null,null,null,null,null,null,null,null,null,null,null,null,null,0,{"$f":"IF(ISBLANK(C13),\"\",IF(AZ13<>1,\"Error - please ensure all columns add to 100%\",\"\"))","v":""}]
[null,11,null,null,null,null,null,null,null,null,null,null,null,null,null,null,null,{"$f":"VLOOKUP(P14,Sheet1!$A$21:$C$57,3,FALSE)","v":{"$error":"#N/A"}},1,{"$f":"VLOOKUP(P14,Sheet1!$A$21:$C$57,2,FALSE)","v":{"$error":"#N/A"}},1,null,null,null,null,null,0,null,null,null,null,null,{"$f":"SUM(AB14:AF14)","v":0},null,null,null,null,null,null,null,null,null,null,null,null,null,null,null,null,null,null,0,{"$f":"IF(ISBLANK(C14),\"\",IF(AZ14<>1,\"Error - please ensure all columns add to 100%\",\"\"))","v":""}]
[null,12,null,null,null,null,null,null,null,null,null,null,null,null,null,null,null,{"$f":"VLOOKUP(P15,Sheet1!$A$21:$C$57,3,FALSE)","v":{"$error":"#N/A"}},1,{"$f":"VLOOKUP(P15,Sheet1!$A$21:$C$57,2,FALSE)","v":{"$error":"#N/A"}},1,null,null,null,null,null,0,null,null,null,null,null,{"$f":"SUM(AB15:AF15)","v":0},null,null,null,null,null,null,null,null,null,null,null,null,null,null,null,null,null,null,0,{"$f":"IF(ISBLANK(C15),\"\",IF(AZ15<>1,\"Error - please ensure all columns add to 100%\",\"\"))","v":""}]
{"$rows_left_out":141}
{"sheet":"Plan National Riposte Covid19","index":4,"n_rows":38,"n_cols":7,"rows_kept":38,"cut":false,"hidden":false,"merged":[]}
[]
[null,"1. Coordination ","2. Surveillance épidémiologique","3. Prévention et contrôle de l'infection","4. Communication de risque et engagement communautaire","5. Capacité des services de santé","6. Sites d'isolement / alimentation / confinement"]
[null,"1.1 Acquerir et installer  du materiel de vidéo conférence ","2.1 Dynamiser le comité National one Health","3.1 Doter les sites de prise en charge , d'isolement et des points d'entrée en matériels et des produits désinfectants ","4.1 Appuyer le fonctionnement et les réunions régulières de la commission communication pendant 6 mois (pausecafé, carburant, carte téléphonique)  ","5.1  Elaborer et reproduire un module de formation en surveillance épidémiologique et biologique et la réponse sur la maladie 2019n_coronavirus ","6.1 Réhabiliter et équiper les sites de prise en charge des cas au niveau des régions "]
[null,"1.2 Doter les secrétariat des comités en Kits informatiques et consommables du bureau  ","2.2 Dynamiser les 8 comités régionaux One Health à tous les niveaux. ","3.2 Doter les sites de soins des incinérateurs modernes ","4.2 Evaluation rapide des connaissances, perceptions et comportements (logiciel du monitorage) ","5.2 Former en cascade les agents de santé sur la surveillance épidémiologique, biologique et la réponse sur la maladie 2019n_coronavirus ","6.2 Acquérir  1000 000 flacons d’1 litre de gels désinfectants au niveau des sites d’isolement et lesstructuresde santé "]
[null,"1.3 Organiser des réunions du Comité de crise  ","2.3 Dynamiser les 72 comités départementaux One Health","3.3 Doter les sites de prise en charge , d'isolement et des points d'entrée des équipements de protection individuelle (EPI) ","4.3 Cartographier les populations à risque de manipulation et les influenceurs, adapter les messages et pre-tester. ","5.3 Rendre Disponible le matériel de protection (kit de protection individuelle)  ","6.3 Aménager et équiper les 54 sites d’isolement des points d’entrée   "]
[null,"1.4 Tenir des réunions hebdomadaires de coordination à tous les niveaux ","2.4 Dynamiser les équipes d’intervention rapide à tous les niveaux ","3.4 Acheter 100 000 000 de masques produits localement en tissu lavable ","4.4 Etablir plans et fiches de monitorage pour chaque activité de communication ","5.4  Fournir les médicaments et autres consommables médicaux de prise en charge symptomatique des cas ","6.4 Assurer la location des sites (Hôtels, Villas, immeubles, ,,,) "]
[null,"1.5 Superviser les  sites d’isolement  ","2.5 Doter le CERMES en réactifs pour le diagnostic des cas suspects  ","3.5 Organiser la distribution porte à porte des masques produits localement et savons ","4.5 Recruter et assurer la prise en charge du personnel nécessaire pour la mise en œuvre du plan ","5.5  Acquérir 1130 boites de  chloroquine de 1000 pour la prise en charge  des patients dans  les 116 sites de prise en charge (bte de 1000) ","6.5 Acquérir 60 tentes de 72 m² pour les 50 sites et 10 pour  les 7 communes de Niamey "]
[null,"1.6 Superviser les sites de prise en charge du pays  ","2.6 Acquerir 2,000,000 tests diagnostics pour et installer  dumateriel de vidéo conférence ","3.6 Acheter 412 500 cartons de 24 savons aux populations vulnérables pour 3 300 000 foyers  ","4.6  Organiser des points de presse, conférence de presse  réguliers et le séminaire gouvernemental sur la situation du Covid-19 ","5.6  Construire et équiper le site de prise en charge de Lazaret ","6.6 Acquérir  30 tentes de 42 m² pour les 50 sites et 10 pour  les 7 communes de Niamey "]
[null,"1.7  Superviser les points d'entrée (PoE) ","2.7 Mettre en place le dispositif d'acheminement des prélèvements des régions vers le niveau central (CERMES)","3.7 Doter les administrations publiques des matériels et des produits désinfectants et les dispositifs de lavage des mains ","4.7 Mettre en place un mécanisme de distribution régulière d’information pour la presse et grand publique et de répondre aux rumeurs (infographie et update journalier sur la situation) ","5.7 Doter 66 structures sanitaires et 50 structures ambilatoires en matériel complet de réaimation pour 10 patients(  7 hôpitaux nationaux, 7 hôpitaux régionaux,  7 centres mère-enfant et 45 hôpitaux de districts d'accès difficiles ) ","6.7 Réhabiliter et équiper le site d'isolement du village chinois à Niamey pour isolement  "]
[null,"1.8  Elaborer les scénarii de l'exercice de simulation à échelle réelle pour tester le Plan National de Préparation et de Réponse aux Urgences Sanitaires "," 2.8 Former les agents de santé dans le cadre de la lutte contre le Covid-19 (Prélèvement) ","3.8 Acquérir 3000 pulverisateurs en pression préalable de 16 litres pour les formations sanitaires ","4.8 Assurer le fonctionnement de la ligne pour la presse  ","5.8  Doter les 66 structures sanitaires et structures ambulatoires en groupes électrogène ","6.8 Assurer l'alimentation des personnes sous isolement  au niveau des sites "]
[null,"1.9 Conduire un exercice de simulation à échelle réelle pour tester le Plan National de Préparation et de Réponse aux Urgences Sanitaires ","2.9 Pré positionner le matériel de prélèvement des cas et autres consommables de laboratoire  ","3.9  Acquérir 3000 pulverisateurs en pression préalable de 1.5 litres pour les formations sanitaires ","4.9 Assurer la prise en charge de 50 agents préventionnistes à déployer aux marchés et gares pour la sensibilisation (prise en charge, crédit de communication et transport) ","5.9  Doter les régions en appareils de production d'oxygiène médical ","6.9  Assurer l'entretien des sites d'isolement "]
[null,"1.10 Conduire un exercice de simulation à échelle réelle pour tester le Plan National de Préparation et de Réponse aux Urgences Sanitaires au niveau de chaque région ","2.10  Doter les formations sanitaires et les points d’entrées terrestres et aéroportuaires en outils de collecte des données ","3.10 Acquérir 300 rampes de 10 robinets de lavage de mains aux différents points d'entrée des marchés ","4.10 Organiser une session d'orientation de 30 journalistes et animateurs radios ","5.10 Doter  28 unités de laboratoire dans les 8 régions et les districts sanitaires éloignés ","6.10  Assurer l'alimentation des personnes des personnes vulnérables  sous isolement  "]
[null,"1.11 Assurer la communication entre les différents niveaux (internet et appel) ","2.11 Motiver les agents des points d’entrée terrestres et aériens  ","3.11 Acquérir 1000 touques de 12 Kgs d'hypochlorite de calcium à 70%  ","4.11  Identifier les influenceurs sur les réseaux sociaux et faire passer les messages ","5.11 Approvisionner les   28 unités de laboratoire en intrants et consommables dans les 8 régions et les districts sanitaires éloignés(paquet de 250 boîtes) "]
[null,"1.12 Organiser des missions d'échange d'expérience ","2.12 Motiver les agents  impliqués dans le suivi des autoisolements","3.12 Equiper les sites de prise en charge, d'isolement et despoints d'entrée de dispositifs d'alimentation en eau potable ","4.12 Développer infographie et vidéographie avec messages clés pour les réseaux sociaux et les médias en ligne et les distribuer ","5.12 Assurer la prise en charge des agents de sécurité des sites d'isolement et de prise en charge "]
[null,"1.13 Organiser les réunions du comité interministériel de lutte contre la pandémie Covid - 19 National ","2.13  Elaborer les procédures opératoires standards (SOPs) ","3.13 Doter les administrations publiques des matériels et des produits désinfectants et les dispositifs de lavage des mains ","4.13 Engager le personnel de santé, médias, ONG et OBC, secteur prive, transport etc. dans la distribution des messages et des produits de communication.  ","5.13 Recruter 1500 agents de santé "]
{"$rows_left_out":23}